Update README.md

1 job for master in 35 seconds (queued for 3 seconds)
latest
Status Job ID Name Coverage
  Test
failed #33657
test

00:00:35

 
Name Stage Failure
failed
test Test
npm ERR! Exit status 1
npm ERR!
npm ERR! Failed at the stylelint-config-team23-scss@0.1.0 lint script.
npm ERR! This is probably not a problem with npm. There is likely additional logging output above.

npm ERR! A complete log of this run can be found in:
npm ERR! /root/.npm/_logs/2019-10-10T05_48_09_674Z-debug.log
npm ERR! Test failed. See above for more details.
ERROR: Job failed: exit code 1